SUBDUCTION
type: Concept
change note: 2013-04-02 08:53:28.0 [tbs1979] insert Definition (id: null text: The process that takes place at convergent boundaries by which one tectonic plate moves under another tectonic plate, sinking into the Earth's mantle, as the plates converge. A subduction zone is an area on Earth where two tectonic plates move towards one another and subduction occurs. language code: en);
change note: 2013-02-18 12:07:21.0 [tbs1979] Insert Concept add broader relation (SUBDUCTION [44dd98d0-a0d0-46b2-bb98-ed887ce7fa60,82551] - TECTONIC PROCESSES [f0bd7eeb-9004-4e40-a649-f6010d8a4303,82507]);
in scheme: sciencekeywords
definition: The process that takes place at convergent boundaries by which one tectonic plate moves under another tectonic plate, sinking into the Earth's mantle, as the plates converge. A subduction zone is an area on Earth where two tectonic plates move towards one another and subduction occurs.

TECTONIC PROCESSES
type: Concept