SPECIES/POPULATION INTERACTIONS
type: Concept

POLLINATOR SPECIES
type: Concept
in scheme: sciencekeywords
definition: Species which transfer pollen from an anther (the male reproductive organ) to a stigma (the receptive part of the female reproductive organ), either of the same flower (self-pollinator) or of a different flower of the same species (cross-pollinator).