NASA P-3
type: Concept
in scheme: platforms
change note: 2021-11-17 13:31:50.0 [tstevens] Move Concepts delete broader relation (null); add broader relation (NASA P-3 [45abac35-586f-4fed-ac38-5dcd59af2cc5,826200] - Propeller [6175c78e-432c-4254-b442-40d3cf0f6b34,835882]);
change note: 2020-03-26 17:48:16.0 [sritz] update WeightedRelation (Platform-Instrument); update WeightedRelation (1.0);
change note: 2020-03-26 18:05:15.0 [sritz] update WeightedRelation (Similar);
change note: 2019-06-26 15:56:42.0 [sritz] update Definition (The P-3B is a specialized aircraft operated as an airborne “platform” in support of NASA’s Science Mission Directorate. The aircraft supports scientific investigations by NASA and visiting scientists from universities, other agencies and organizations worldwide. With instruments installed, the aircraft serves an economical test bed for studying the Earth and for new concepts in satellite design. The aircraft supports scientific studies across all disciplines of Earth Science such as forest ecology, atmospherics, ocean and ice dynamics, land processes and many more. The P-3 aircraft can carry instrument payloads consisting of one to several at once while supporting Earth studies all over the globe. Scientific instrument installations on the aircraft generally consist of external components such as a sensors, antennas or probes while inside the aircraft the supporting control and data analysis computers are installed in specially designed rack modules. Multiple instrument payloads are an economical way for cooperating scientists to intercompare data when studying Earth processes. A diverse mix of engineers, technicians, scientists, pilots and managers all team together to safely complete the aircraft-instrument integration designs and hardware fabrications and conduct the flight portions of studies. Once designed, all components can be quickly and economically Group: Platform_Details Entry_ID: NASA P-3 Group: Platform_Identification Platform_Category: Aircraft Short_Name: NASA P-3 End_Group Creation_Date: 2012-07-18 Online_Resource: https://www.nasa.gov/pdf/219397main_P-3B_fact_sheet.pdf End_Group);
change note: 2020-03-26 17:47:40.0 [sritz] insert WeightedRelation (id: null related concept uuid: 5e573a56-b485-4a7f-a652-6d941e7d0ce0 relationship type: null relationship value: null generated by: null);
change note: 2022-02-17 12:43:10.0 [tstevens] update Definition (The P-3B is a specialized aircraft operated as an airborne “platform” in support of NASA’s Science Mission Directorate. The aircraft supports scientific investigations by NASA and visiting scientists from universities, other agencies and organizations worldwide. With instruments installed, the aircraft serves an economical test bed for studying the Earth and for new concepts in satellite design. The aircraft supports scientific studies across all disciplines of Earth Science such as forest ecology, atmospherics, ocean and ice dynamics, land processes and many more. The P-3 aircraft can carry instrument payloads consisting of one to several at once while supporting Earth studies all over the globe. Scientific instrument installations on the aircraft generally consist of external components such as a sensors, antennas or probes while inside the aircraft the supporting control and data analysis computers are installed in specially designed rack modules. Multiple instrument payloads are an economical way for cooperating scientists to intercompare data when studying Earth processes. A diverse mix of engineers, technicians, scientists, pilots and managers all team together to safely complete the aircraft-instrument integration designs and hardware fabrications and conduct the flight portions of studies. Once designed, all components can be quickly and economically.); update Definition (NASA);
change note: 2020-03-26 18:07:15.0 [sritz] update WeightedRelation (Undefined);
definition: The P-3B is a specialized aircraft operated as an airborne “platform” in support of NASA’s Science Mission Directorate. The aircraft supports scientific investigations by NASA and visiting scientists from universities, other agencies and organizations worldwide. With instruments installed, the aircraft serves an economical test bed for studying the Earth and for new concepts in satellite design. The aircraft supports scientific studies across all disciplines of Earth Science such as forest ecology, atmospherics, ocean and ice dynamics, land processes and many more. The P-3 aircraft can carry instrument payloads consisting of one to several at once while supporting Earth studies all over the globe. Scientific instrument installations on the aircraft generally consist of external components such as a sensors, antennas or probes while inside the aircraft the supporting control and data analysis computers are installed in specially designed rack modules. Multiple instrument payloads are an economical way for cooperating scientists to intercompare data when studying Earth processes. A diverse mix of engineers, technicians, scientists, pilots and managers all team together to safely complete the aircraft-instrument integration designs and hardware fabrications and conduct the flight portions of studies. Once designed, all components can be quickly and economically.

Propeller
type: Concept