LAND SURFACE MODELS
type: Concept
in scheme: sciencekeywords
definition: Models that predict the characteristics of the landscape such as DEMs/DTMs. Also included are models that predict land surface reflectance including the scattering, absorption, or reflection of electromagnetic radiation at the land surface.

MODELS
type: Concept