GEOTERREX
type: Concept
in scheme: providers
definition: This is a non-exclusive database of high resolution aeromagnetic surveys. Coverage currently exists in Alberta and British Columbia. Most sites are located in Northern Alberta. There are four maps in the database for Canada. Summary Provided By: http://geodiscover.cgdi.ca/gdp/search?action=fullMetadata&entryId=5243&entryLang=fr&entryType=productCollection

COMMERCIAL
type: Concept