Two-Way Travel Time
type: Concept

RADAR
type: Concept

RADAR REFLECTIVITY
type: Concept
change note: 2020-09-29 07:54:59.0 [tstevens] Insert Concept add narrower relation (RADAR REFLECTIVITY [46975e66-863a-49c9-b673-b2e099a04c85,84013] - Two-Way Travel Time [f83494dd-92c7-46ad-afec-66da5eb425c1,560727]);
in scheme: sciencekeywords
definition: The property of illuminated objects to reradiate a portion of the incident microwave energy.