Quasars
type: Concept
change note: 2022-02-25 13:32:35.0 [tstevens] Insert Concept add broader relation (Quasars [46bdd77f-96e9-4931-a1d5-cd8ef94a83b3,836046] - VLBI [b1168d43-61e3-4f14-abbd-dac7318a9324,828115]);
in scheme: instruments
definition: Quasars are very bright, distant, and active supermassive black holes that are millions to billions of times the mass of the Sun. Typically located at the centers of galaxies, they feed on infalling matter and unleash fantastic torrents of radiation. Among the brightest objects in the universe, a quasar’s light outshines that of all the stars in its host galaxy combined, and its jets and winds shape the galaxy in which it resides.

VLBI
type: Concept