ADVECTION
type: Concept
change note: 2021-10-22 10:06:21.0 [tstevens] insert Definition (id: null text: Refers to the transport of salt within the ocean. language code: en);
change note: 2020-08-17 14:26:27.0 [sritz] Insert Concept add broader relation (ADVECTION [470e3f31-86af-4a9b-9279-ce1ba125d1dd,560603] - OCEAN SALINITY BUDGET [8c0570f6-c5d1-4675-99be-68d9d3b9d90c,560601]);
in scheme: sciencekeywords
definition: Refers to the transport of salt within the ocean.

OCEAN SALINITY BUDGET
type: Concept