ACADEMIC
type: Concept

UNIGE
type: Concept
change note: 2012-07-30 15:00:15.0 [aaleman] Insert Concept add broader relation (UNIGE [4737e37b-ad94-4557-95e4-5f3c675d3557,40413] - ACADEMIC [7700280b-68ee-4644-bf5e-84e7a6adf897,24357]);
in scheme: providers
definition: The University of Genoa (in Italian: Università degli Studi di Genova) is one of the largest universities in Italy. Located in Liguria on the Italian Riviera, the university was founded in 1481. It currently has about 40,000 students, 1,800 teaching and research staff and about 1,580 administrative staff. The university is headed by a rector and divided into 11 faculties: Faculty of Architecture Faculty of Arts and Philosophy Faculty of Economics Faculty of Educational Sciences Faculty of Engineering Faculty of Foreign Languages and Literatures Faculty of Law Faculty of Mathematical, Physical and Natural Sciences Faculty of Medicine and Surgery Faculty of Pharmacology Faculty of Political Sciences The University of Genoa counts also 53 research departments and a department that supplies general ICT services.