PAZ-SAR
type: Concept
change note: 2020-06-25 12:27:02.0 [mmorahan] insert AltLabel (id: null category: primary text: PAZ - Synthetic Aperture Radar (X-band) language code: en);
change note: 2020-06-25 12:21:38.0 [mmorahan] Insert Concept add broader relation (PAZ-SAR [474a09e5-315c-42e4-9521-36153eafb049,560496] - Imaging Radars [824070fa-da29-40fa-ba17-f3d60584bd4d,544765]);
change note: 2020-06-25 16:24:31.0 [mmorahan] delete WeightedRelation (null); insert WeightedRelation (id: null related concept uuid: 8ac70aba-53e7-45c0-8b4a-2c0197114b09 relationship type: null relationship value: null generated by: null);
change note: 2020-06-25 16:23:02.0 [mmorahan] insert WeightedRelation (id: null related concept uuid: 474a09e5-315c-42e4-9521-36153eafb049 relationship type: null relationship value: null generated by: null);
change note: 2020-06-25 16:25:26.0 [mmorahan] insert Definition (id: null text: The objective of the PAZ-SAR instrument is to provide high quality SAR imagery in a variety of sizes and resolution ranging from medium over wide regions up to very high resolution (e.g. meter and sub-meter). Operational flexibility with multi-mode, multi-polarization and left and right looking attitude is one of the major PAZ System requirements leading to a quite large number of different instrument configurations and antenna beams. The PAZ-SAR instrument comprises an X-band active phased array antenna with an operation instantaneous bandwidth up to 300 MHz. The SAR antenna (with a size of 4.8 m x 0.7 m) consists of 12 panels in azimuth direction – assembled in three mechanical leaves – each with 32 dual-polarized subarrays. Each individual subarray is driven by a TRM (Transmit-Receive Module) adjustable in amplitude and phase by applying complex excitation coefficients. language code: en);
in scheme: instruments
definition: The objective of the PAZ-SAR instrument is to provide high quality SAR imagery in a variety of sizes and resolution ranging from medium over wide regions up to very high resolution (e.g. meter and sub-meter). Operational flexibility with multi-mode, multi-polarization and left and right looking attitude is one of the major PAZ System requirements leading to a quite large number of different instrument configurations and antenna beams. The PAZ-SAR instrument comprises an X-band active phased array antenna with an operation instantaneous bandwidth up to 300 MHz. The SAR antenna (with a size of 4.8 m x 0.7 m) consists of 12 panels in azimuth direction – assembled in three mechanical leaves – each with 32 dual-polarized subarrays. Each individual subarray is driven by a TRM (Transmit-Receive Module) adjustable in amplitude and phase by applying complex excitation coefficients.

Imaging Radars
type: Concept