CLOUD DROPLET CONCENTRATION/SIZE
type: Concept
change note: 2013-02-14 14:36:16.0 [mpmorahan] Rename Concept update PrefLabel (CLOUD DROPLET CONCENTRATION/SIZE);
change note: 2013-02-14 14:34:49.0 [mpmorahan] Move Concepts delete broader relation (null); add broader relation (DROPLET CONCENTRATION/SIZE [47812ef8-b64b-4988-9ae4-31f3581ae9a5,62023] - CLOUD MICROPHYSICS [0cfcbaa7-727b-4199-8cca-93824b427e9b,82137]);
in scheme: sciencekeywords
definition: The physical size of water droplets and the number of water droplets recorded in a given area or volume within a cloud.

CLOUD MICROPHYSICS
type: Concept