LMA
type: Concept
change note: 2019-02-05 16:44:57.0 [sritz] insert Definition (id: null text: A lightning mapping array is a network of time-of-arrival sensors that passively receive VHF impulses from electrical breakdown within thunderstorms. language code: en);
change note: 2019-02-05 16:43:51.0 [sritz] Insert Concept add broader relation (LMA [47fa86bf-3472-4539-bb2e-a08020dc2090,368469] - Imaging Spectrometers/Radiometers [944b7691-af37-4fb4-9393-c114e7997829,347979]);
change note: 2019-02-05 16:44:23.0 [sritz] insert AltLabel (id: null category: primary text: Lightning Mapping Array language code: en);
in scheme: instruments
definition: A lightning mapping array is a network of time-of-arrival sensors that passively receive VHF impulses from electrical breakdown within thunderstorms.

Imaging Spectrometers/Radiometers
type: Concept