ACADEMIC
type: Concept

U-WALES-SWAN/BIO
type: Concept
in scheme: providers
definition: Swansea University has the perfect environment in which to live and study. Our parkland campus has a spectacular seafront location within easy reach of a vibrant city. With a long history of academic success and a modern approach to study, Swansea could be the right choice for you. Summary Provided By: http://www.swan.ac.uk/research_innovation/ResearchInnovationOffice/CaseStudies/SchooloftheEnvironmentandSociety/