Headwall
type: Concept
change note: 2019-10-07 12:18:34.0 [sritz] insert AltLabel (id: null category: primary text: Headwall Hyperspectral Camera language code: en); insert Definition (id: null text: The Headwall family of hyperspectral cameras are line-scanning hyperspectral cameras (sometimes called pushbroom) that collect reflected light through an image slit. One row of spatial pixels is collected per frame as motion occurs, with each pixel containing full spectral data. Headwall's standard hyperspectral imaging ranges may include UV-VIS (250-500nm), VNIR (400-1000nm), Extended VNIR (550-1700nm), NIR (900-1700nm), and SWIR (900-2500nm). The spectral imaging sensors are used aboard UAV, aircraft, or satellite platforms. language code: en);
change note: 2019-10-07 12:17:24.0 [sritz] Insert Concept add broader relation (Headwall [4836842d-fcbe-41a1-8481-8edf9fed2307,369221] - Cameras [d322ae9d-bde0-448f-948d-777aef096eb6,348777]);
in scheme: instruments
definition: The Headwall family of hyperspectral cameras are line-scanning hyperspectral cameras (sometimes called pushbroom) that collect reflected light through an image slit. One row of spatial pixels is collected per frame as motion occurs, with each pixel containing full spectral data. Headwall's standard hyperspectral imaging ranges may include UV-VIS (250-500nm), VNIR (400-1000nm), Extended VNIR (550-1700nm), NIR (900-1700nm), and SWIR (900-2500nm). The spectral imaging sensors are used aboard UAV, aircraft, or satellite platforms.

Cameras
type: Concept