UDEC-CL/COPAS
type: Concept
in scheme: providers
definition: The aim of the Center is to promote multidisciplinary work of an important team of oceanographers which has reached significant levels of scientific development and productivity and capable of making an important contribution toward the solution of problems related with the country's development. In addition, education at the doctoral and postdoctoral levels is a very important component of the Center. Summary Provided By: http://copas.udec.cl/eng/copas/index.php

ACADEMIC
type: Concept