AQDH
type: Concept
change note: 2022-01-14 08:27:25.0 [tstevens] Insert Concept add broader relation (AQDH [48b63b37-24ba-4707-8aa9-72d53ab79f96,836017] - A - C [0c89f3f4-7ab1-43ce-89ee-795d35f0e30a,828949]);
in scheme: projects
definition: A collection of air quality data that can be used for health-related research and applications.

A - C
type: Concept