Current/Wind Meters
type: Concept

TAMMS
type: Concept
change note: 2020-05-26 17:10:48.0 [sritz] insert Definition (id: null text: TAMMS instrument is composed of multiple subsystems that include the gust probe, the inertial navigation system (INS), the data processing system, and the water vapor/trace gas sensors. Rationale: There are datasets at the GHRC DAAC under the IMPACTS field campaign that consist of this instrument. language code: en);
change note: 2020-05-26 17:08:47.0 [sritz] insert AltLabel (id: null category: primary text: Turbulent Air Motion Measurement System (TAMMS) language code: en);
change note: 2020-05-26 17:08:05.0 [sritz] Insert Concept add broader relation (TAMMS [48f3dfd2-bd42-4731-a9d1-fd58eb98e7bf,560279] - Current/Wind Meters [1b41692e-c7fe-4567-bed9-b938a7400462,543331]);
in scheme: instruments
definition: TAMMS instrument is composed of multiple subsystems that include the gust probe, the inertial navigation system (INS), the data processing system, and the water vapor/trace gas sensors. Rationale: There are datasets at the GHRC DAAC under the IMPACTS field campaign that consist of this instrument.