COLOSTATE/WCNR
type: Concept
in scheme: providers
definition: The Warner College of Natural Resources (WCNR) offers the most comprehensive natural resources program in the country with seven majors, nine minors and fourteen concentrations that focus on critical environmental management problems. We have a student body of 1,300 high-achieving and dedicated undergraduate and graduate students who are passionate about their education and their future careers in natural resources. Summary Provided By: http://warnercnr.colostate.edu/

ACADEMIC
type: Concept