C-SCAT
type: Concept
in scheme: instruments
definition: The C-Band Scatterometer (C-SCAT) is used for NOAA?s (National Oceanographic and Atmospheric Administration) Climatic Data Center and measures ocean surface wind vectors.

Scatterometers
type: Concept