FOREST YIELDS
type: Concept
in scheme: sciencekeywords
definition: Amount of product output recovered from a quantity of raw material input in forest product industries. - Estimate in forest mensuration of the amount of wood that may be harvested from a particular type of forest stand by species, site, stocking, and management regime at various ages.

FOREST SCIENCE
type: Concept