OR-STATE/FS
type: Concept
in scheme: providers
definition: Welcome to the Department of Forest Science at Oregon State University! Unlike other departments in the College of Forestry, we offer only graduate degrees, so our emphasis is on graduate education, research, and dissemination of information to woodland owners, natural resource professionals and the public. Our faculty are acknowledged as world-class leaders in their fields, which span a spectrum of biological disciplines including genetics and tree improvement, tree physiology, forest health, sustainable forestry, agroforestry, community and ecosystem ecology, wildlife biology, and silviculture. Summary Provided By: http://www.forestry.oregonstate.edu/cof/fs/about.php

ACADEMIC
type: Concept