HEAVY METALS
type: Concept
in scheme: sciencekeywords
definition: Those metals which have densities >5.0 Mg m-3. In soils these include the elements Cd, Co, Cr, Cu, Fe, Hg, Mn, Mo, Ni, Pb, and Zn.

SOILS
type: Concept