UNE-L/EAS
type: Concept
change note: 2018-05-04 10:55:44.0 [tstevens] insert AltLabel (id: null category: primary text: Earth and Atmospheric Sciences, University of Nebraska, Lincoln language code: en); insert Definition (id: null text: The University of Nebraska-Lincoln’s Department of Earth & Atmospheric Sciences offers majors in geology or meteorology-climatology and encompasses an array of disciplines related to the study earth, air, and water. language code: en); insert Resource (id: null type: provider url: https://eas.unl.edu/);
change note: 2018-05-04 10:54:05.0 [tstevens] Insert Concept add broader relation (UNE-L/EAS [49f465f2-9d88-4221-b1ad-ea9383617d0e,367575] - ACADEMIC [7700280b-68ee-4644-bf5e-84e7a6adf897,337181]);
in scheme: providers
definition: The University of Nebraska-Lincoln’s Department of Earth & Atmospheric Sciences offers majors in geology or meteorology-climatology and encompasses an array of disciplines related to the study earth, air, and water.

ACADEMIC
type: Concept