MN/DOA/OGDA/LMIC
type: Concept
in scheme: providers
definition: The Land Management Information Center at the University of Minnesota serves Minnesota by helping other government and non-government organizations achieve better, faster, and more cost-effective results for the state through the creative use of GIS and other geospatial information technologies Website: http://www.lmic.state.mn.us/

ACADEMIC
type: Concept