RAY-FINNED FISHES
type: Concept

NEEDLEFISHES
type: Concept
change note: 2017-03-15 09:22:16.0 [mgenazzi] Definition added insert Definition (id: null text: Phylum Chordata. Class Actinopterygii. Order Beloniformes. Needlefish are slender piscivorous marine fish characterized by long, narrow beak with sharp teeth language code: en);
in scheme: sciencekeywords
definition: Phylum Chordata. Class Actinopterygii. Order Beloniformes. Needlefish are slender piscivorous marine fish characterized by long, narrow beak with sharp teeth