DOI/USGS/GD/PUBS/WR/GEOPUBS
type: Concept
in scheme: providers
definition: The USGS Western Region provides links to the top-level USGS geologic websites in the Western United States from its home page. Western Coastal & Marine Geology conduct multidisciplinary scientific research in the coastal and offshore areas of California, Oregon, Washington, Alaska, Hawaii, and other US Pacific Islands; and in other waterways of the United States. The Data Series is directed to core professional and non-core professional audiences. The Data Series is intended for release of basic data sets, databases, and multimedia or motion graphics. This series can be used for videos, computer programs, and collections of digital photographs. Polished videos that are technical or scientific rather than outreach are placed in this series; such videos do not require concept approval by the Department of the Interior before production can begin. The USGS publications and Data Products is a national site national site for all USGS products: ordering information, catalogs, locators, and links to online biologic, geologic, mapping and water science products. Website: "http://geopubs.wr.usgs.gov/" [Summary provided by the USGS.]

USGS
type: Concept