FLUVIAL LANDFORMS
type: Concept

MARSH
type: Concept
change note: 2013-08-15 12:53:08.0 [tbs1979] insert Definition (id: null text: Type of wetland, featuring grasses, rushes, reeds, typhas, sedges, and other herbaceous plants (possibly with low-growing woody plants) in a context of shallow water. language code: en);
change note: 2013-08-05 12:35:42.0 [tbs1979] Insert Concept add broader relation (MARSH [4c09d43f-68d5-469d-aaed-f9ef8968ef2e,105319] - FLUVIAL LANDFORMS [bdc0bd86-a3a3-48fa-b1fb-4ca5d13d4dde,105281]);
in scheme: sciencekeywords
definition: Type of wetland, featuring grasses, rushes, reeds, typhas, sedges, and other herbaceous plants (possibly with low-growing woody plants) in a context of shallow water.