V - Z
type: Concept

WATER
type: Concept
change note: 2022-08-30 07:32:23.0 [tstevens] insert AltLabel (id: null category: primary text: Water Resources Data Collection language code: en); insert Definition (id: null text: The Water Resources collection provides spatial data on water resources. language code: en);
change note: 2022-08-30 07:30:57.0 [tstevens] Insert Concept add broader relation (WATER [4c4878cb-18f5-464c-b4bb-858273a48d6a,1040764] - V - Z [c8e3dd70-6b82-4034-9e23-b892b302d8b4,1034982]);
in scheme: projects
definition: The Water Resources collection provides spatial data on water resources.