Riegl LD90-3100VHS-FLP
type: Concept
change note: 2023-03-16 11:43:40.0 [sritz] Insert Concept add broader relation (Riegl LD90-3100VHS-FLP [4d3b9c87-39ca-423a-82d7-1ee2bf8d01e9,1246977] - Laser Ranging [a3ce2cfb-5488-4301-83c2-64bbc090c397,1238838]);
change note: 2023-03-16 11:44:07.0 [sritz] insert AltLabel (id: null category: primary text: Riegl LD90-3100VHS-FLP First & Last Pulse Distance Meter language code: en);
change note: 2023-03-16 11:46:39.0 [sritz] insert Definition (id: null text: Laser Distance Meter for use with or without reflectors which, because of its long-range and its “First & Last Pulse" facility, is especially well suited for scanner applications. language code: en);
definition: Laser Distance Meter for use with or without reflectors which, because of its long-range and its “First & Last Pulse" facility, is especially well suited for scanner applications.
in scheme: instruments

Laser Ranging
type: Concept