NASA/MSFC/LIFTOFF
type: Concept
in scheme: providers
definition: Located on Redstone Arsenal in Huntsville, Ala., Marshall provides the multidiscipline engineering expertise behind propulsion and transportation systems such as the space shuttle and Ares rockets. Marshall continues to enable scientific discovery through development of hardware and instruments for projects including the Chandra X-ray Observatory, the GLAST Gamma-ray Burst Monitor, and Gravity Probe B. The center develops, integrates, and operates major components and systems on the International Space Station and supports its operations around the clock. Summary Provided By: http://www.nasa.gov/centers/marshall/about/index.html

NASA
type: Concept