DOI/USGS/GECSE
type: Concept
change note: 2018-06-01 07:45:56.0 [tstevens] insert AltLabel (id: null category: primary text: Geosciences and Environmental Change Science Center, U.S. Geological Survey, U.S. Department of the Interior language code: en); insert Definition (id: null text: GECSC researchers conduct multi-purpose geologic mapping and topical scientific studies to address issues concerning geologic, climatic, ecosystem, and land surface changes; human interactions with the environment; and physical, chemical, and biological characterization of the Earth's surface and upper crust. language code: en); insert Resource (id: null type: provider url: https://www.usgs.gov/centers/gecsc);
change note: 2018-06-01 07:43:56.0 [tstevens] Insert Concept add broader relation (DOI/USGS/GECSE [4da520b7-dcf2-4911-a815-87590a5b5253,367635] - USGS [5fea4160-25a7-44b5-bfba-ef140fdffaf4,337197]);
in scheme: providers
definition: GECSC researchers conduct multi-purpose geologic mapping and topical scientific studies to address issues concerning geologic, climatic, ecosystem, and land surface changes; human interactions with the environment; and physical, chemical, and biological characterization of the Earth's surface and upper crust.

USGS
type: Concept