BROWN/GEO
type: Concept
in scheme: providers
definition: The goal of the Department of Geological Sciences is excellence in both teaching and research. The Undergraduate students enjoy small class sizes in modern teaching facilities, and even in their first year have the opportunity to get involved in cutting-edge research. Summary Provided By: http://www.geo.brown.edu/

ACADEMIC
type: Concept