BIODIVERSITY FUNCTIONS
type: Concept
in scheme: sciencekeywords
definition: Biodiversity is the variety of life: the different plants, animals and micro-organisms, their genes and the ecosystems of which they are a part.

COMMUNITY DYNAMICS
type: Concept