DOI/USGS/CBOS
type: Concept
in scheme: providers
definition: The Chesapeake Bay Observing System provides weather data from various stations along the Chesapeake Bay. http://md.water.usgs.gov/posters/CBOS/

USGS
type: Concept