M - O
type: Concept

NMDB
type: Concept
in scheme: projects
definition: NMDB is a database created by teams from 12 different countries, funded in 2008-09 by the European Union’s 7th Framework Programme. All neutron monitors operated in Europe and some neighbouring countries pool their data to make them available in real-time and provide easy-to use data products to scientists and other users. http://www.nmdb.eu/sites/default/files/NMDB_Brochure_4.pdf http://www.nmdb.eu/