CONSORTIA/INSTITUTIONS
type: Concept

JGRASS
type: Concept
in scheme: providers
definition: JGrass is a free, multi platform, open source GIS based on the famous GIS Grass, developed in Java by CUDAM, Hydrologis and ICENS (so far). At the moment JGrass (or better its tools) is dedicatated mostly to hydrological and geomophological analyses. This is due to the fact that the main sponsors of the project are the CUDAM and Hydrologis. The involved University department and the tutorship of Riccardo Rigon makes JGrass a very complete piece of software to deal with environmental issues in the field of Hydrology and Morphology. Summary Provided By: http://jgrass.dev.fsc.bz.it/