NEUTRON MONITORS
type: Concept
in scheme: instruments
definition: NEUTRON MONITORS are devices that observe and study by way of measurement and recording data about the neutron or uncharged (neutral) subatomic particle.

Chemical Meters/Analyzers
type: Concept