RUTGERS/CUPR
type: Concept
in scheme: providers
definition: The Center for Urban Policy Research at Rutgers University has served the nation with basic and applied research on a broad spectrum of public policy issues. CUPR, a component of the Edward J. Bloustein School of Planning and Public Policy, is nationally and internationally recognized for its research on affordable housing, land use policy, the arts and cultural policy, development impact analysis, the costs of sprawl, transportation information systems, environmental impacts, and community economic development. CUPR has developed a wide array of fiscal, environmental, transportation, and quality of life impact models that have been used in major public policy evaluations throughout the United States. Website: "http://policy.rutgers.edu/cupr/" [Summary provided by Rutgets University.]

ACADEMIC
type: Concept