LAND RECORDS
type: Concept

PALEOSOLS
type: Concept
change note: 2012-07-23 17:25:00.0 [mpmorahan] insert Definition (id: null text: Paleosols are soils that formed in a landscape of the past with distinctive morphological features resulting from a soil-forming environment that no longer exists at the site. language code: en);
change note: 2012-06-26 14:47:05.0 [gee-cee] Insert Concept add broader relation (PALEOSOLS [4fe601b0-314f-4f63-8ec1-3b96cc7263b8,40009] - LAND RECORDS [2bedb6b3-6e92-42e2-b382-60e2a6aab8e9,39979]);
in scheme: sciencekeywords
definition: Paleosols are soils that formed in a landscape of the past with distinctive morphological features resulting from a soil-forming environment that no longer exists at the site.