NON-GOVERNMENT/NON-PROFIT ORGANIZATIONS
type: Concept

AGI-UK/GIG
type: Concept
in scheme: providers
definition: UK GEMINI (Geo-spatial Metadata Interoperability Initiative) The UK GEMINI profile is the result of a year-long collaboration between the Association for Geographic Information (AGI) and the Cabinet Office e-Government Unit, with additional representation from national and local government, and the academic community. The standard document is supplemented by a set of guideline documents giving additional advice and best practice. Summary Provided By: http://www.gigateway.org.uk/metadata/standards.html