INTEVATION
type: Concept
in scheme: providers
definition: Intevation GmbH is an intelligent consulting company consequently based on Free Software. They offer communication management for Free Software projects and strategic consulting for Free Software business models. Additional business units are geographic information systems and usability design. They also actively contribute to the Free Software Community and supports freegis.org and the FSF Europe among other projects. Website: http://intevation.net/

COMMERCIAL
type: Concept