ARK-VII/3B
type: Concept
in scheme: projects
definition: The aim of this project was to map the crustal structure of totally different geological units in a region of close proximity and to map the sedimentary distribution and the western boundary of the Mesozoic sediment basin of Jameson Land.

A - C
type: Concept