NASA
type: Concept

NASA/JPL/ASO
type: Concept
change note: 2016-11-11 13:54:37.0 [aaleman] added new data center at request of NSIDC insert AltLabel (id: null text: Airborne Snow Observatory, Jet Propulsion Laboratory, NASA language code: en);
change note: 2016-11-11 13:53:26.0 [aaleman] Insert Concept add broader relation (NASA/JPL/ASO [511e9d80-200b-425f-9213-4688c0ff6246,278487] - NASA [4fd0aa9d-1a80-4dde-8452-c69b5c4d08cc,249071]);
in scheme: providers
definition: The two most critical properties for understanding snowmelt runoff and timing are the spatial and temporal distributions of snow water equivalent (SWE) and snow albedo. Despite their importance in controlling volume and timing of runoff, snowpack albedo and SWE are still largely unquantified in the US and not at all in most of the globe, leaving runoff models poorly constrained. NASA/JPL, in partnership with the California Department of Water Resources, has developed the Airborne Snow Observatory (ASO), an imaging spectrometer and scanning lidar system, to quantify SWE and snow albedo, generate unprecedented knowledge of snow properties for cutting edge cryospheric science, and provide complete, robust inputs to water management models and systems of the future. Funding provided by NASA Terrestrial Hydrology, NASA Applied Sciences, and California Department of Water Resources