ACADEMIC
type: Concept

UI-UC/GMS
type: Concept
in scheme: providers
definition: The Geographic Modeling Systems Lab at the University of Illinois at Urbana- Champaign is involved in the design and development of advanced tools for geographical modeling in a variety of environmental systems. Research areas include: -Environmental Modeling -Visualization -Spatial Analysis -Information Systems -Sketch Planning -High Performance Systems -Project archives Website: http://www.gis.uiuc.edu/ [Summary provided by the University of Illinois at Urbana-Champaign.]