CONSORTIA/INSTITUTIONS
type: Concept

CGIAR/ASB
type: Concept
in scheme: providers
definition: The CGIAR web site is a collaborative effort of many individuals in the CGIAR system. While each research center's web site is managed solely by the individual center, the CGIAR system web site is managed by the CGIAR Secretariat. The CGIAR Secretariat redesigned the site in December 2004 and wishes to thank all CGIAR staff for their input and collaboration. The pictures used throughout the site are from the CGIAR photo collection. Summary Provided By: http://www.cgiar.org/about.html