BIRDS
type: Concept

SANDPIPERS
type: Concept
change note: 2017-03-15 10:41:48.0 [mgenazzi] Definition added insert Definition (id: null text: Phylum Chordata. Class Aves. Order Charadriiformes. Sandpipers are shorebirds with long bodies and legs and narrow wings language code: en);
in scheme: sciencekeywords
definition: Phylum Chordata. Class Aves. Order Charadriiformes. Sandpipers are shorebirds with long bodies and legs and narrow wings