USDA
type: Concept

USDA/FS/LAR
type: Concept
in scheme: providers
definition: The USDA Forest Service Land and Realty Management division organizes and facilitates some of the multiple uses and activities that take place in national forests. Website: "http://www.fs.fed.us/land/staff/" [Summary provided by the USDA.]