PARASITISM
type: Concept
change note: 2013-09-16 16:06:47.0 [epneff] Move Concepts add broader relation (PARASITISM [51f3e55c-b694-4028-86fe-604a52dc794f,85435] - SPECIES/POPULATION INTERACTIONS [58f39353-7e1c-4884-9501-376cd0377fbf,84195]); delete broader relation (null);
change note: 2013-09-16 16:05:39.0 [epneff] Move Concepts add broader relation (PARASITISM [51f3e55c-b694-4028-86fe-604a52dc794f,85435] - MUTUALISM [003466f4-9ee7-4d3b-81ff-2013add292e2,86129]); delete broader relation (null);
in scheme: sciencekeywords
definition: Parasitism is where two species live in an obligatory association in which the parasite depends metabolically on the host .

SPECIES/POPULATION INTERACTIONS
type: Concept