CROWNPUB
type: Concept
in scheme: providers
definition: Crown Publications is the authorized distributor of B.C. acts, regulations and related legislative publications, such as the Revised Statutes and the Consolidated Regulations. We are licensed to sell selected B.C. Government Ministry publications and subscriptions. Crown Publications is an authorized agent for Canadian Federal Government publications, nautical charts, legislation, and topographical maps. Crown Publications provides mail order service world wide for all products listed at our web site and in our catalogue. We also maintain notification, subscription and standing order lists for many publications. We have a storefront location in Victoria, British Columbia, Canada as well as our Cyber Bookstore on the Internet. Website: "http://www.crownpub.bc.ca/" [Summary provided by Crown Publications, Inc.]

COMMERCIAL
type: Concept