REFERENCE AND INFORMATION SERVICES
type: Concept

THESAURI
type: Concept
in scheme: sciencekeywords
definition: 1.A book of synonyms, often including related and contrasting words and antonyms. 2.A book of selected words or concepts, such as a specialized vocabulary of a particular field, as of medicine or music